PFR,UniProt Id,Entry Accession,Entry Description,Isoform Accession,Isoform Description,Isoform Sequence,Start,End,Length,Proteoform Sequence,Monoisotopic Mass,Average Mass,Sequence Modifications,PTMs,N-Terminal,C-Terminal,Star
15331,PHB2_HUMAN,Q99623,Prohibitin-2,Q99623-2,2,MAQNLKDLAGRLPAGPRGMGTALKLLLGAGAVAYGVRESVFTVEGGHRAIFFNRIGGVQQDTILAEGLHFRIPWFQYPIIYDIRARPRKISSPTGSKDLQMVNISLRVLSRPNAQELPSMYQRLGLDYEERVLPSIVNEVLKSVVAKFNASQLITQRAQVSLLIRRELTERAKDFSLILDDVAITELSFSREYTAAVEAKQVALSKNPGYIKLRKIRAAQNISKTIATSQNRIYLTADNLVLNLQDESFTRGSDSLIKGKK,1,260,260,AQNLKDLAGRLPAGPRGMGTALKLLLGAGAVAYGVRESVFTVEGGHRAIFFNRIGGVQQDTILAEGLHFRIPWFQYPIIYDIRARPRKISSPTGSKDLQMVNISLRVLSRPNAQELPSMYQRLGLDYEERVLPSIVNEVLKSVVAKFNASQLITQRAQVSLLIRRELTERAKDFSLILDDVAITELSFSREYTAAVEAKQVALSKNPGYIKLRKIRAAQNISKTIATSQNRIYLTADNLVLNLQDESFTRGSDSLIKGKK,28936.69908969,28954.45938,,RESID:41@0,,,1
15332,PHB2_HUMAN,Q99623,Prohibitin-2,Q99623-2,2,MAQNLKDLAGRLPAGPRGMGTALKLLLGAGAVAYGVRESVFTVEGGHRAIFFNRIGGVQQDTILAEGLHFRIPWFQYPIIYDIRARPRKISSPTGSKDLQMVNISLRVLSRPNAQELPSMYQRLGLDYEERVLPSIVNEVLKSVVAKFNASQLITQRAQVSLLIRRELTERAKDFSLILDDVAITELSFSREYTAAVEAKQVALSKNPGYIKLRKIRAAQNISKTIATSQNRIYLTADNLVLNLQDESFTRGSDSLIKGKK,1,260,260,AQNLKDLAGRLPAGPRGMGTALKLLLGAGAVAYGVRESVFTVEGGHRAIFFNRIGGVQQDTILAEGLHFRIPWFQYPIIYDIRARPRKISSPTGSKDLQMVNISLRVLSRPNAQELPSMYQRLGLDYEERVLPSIVNEVLKSVVAKFNASQLITQRAQVSLLIRRELTERAKDFSLILDDVAITELSFSREYTAAVEAKQVALSKNPGYIKLRKIRAAQNISKTIATSQNRIYLTADNLVLNLQDESFTRGSDSLIKGKK,28894.68852469,28912.41938,,,,,1
15333,PHB2_HUMAN,Q99623,Prohibitin-2,Q99623-2,2,MAQNLKDLAGRLPAGPRGMGTALKLLLGAGAVAYGVRESVFTVEGGHRAIFFNRIGGVQQDTILAEGLHFRIPWFQYPIIYDIRARPRKISSPTGSKDLQMVNISLRVLSRPNAQELPSMYQRLGLDYEERVLPSIVNEVLKSVVAKFNASQLITQRAQVSLLIRRELTERAKDFSLILDDVAITELSFSREYTAAVEAKQVALSKNPGYIKLRKIRAAQNISKTIATSQNRIYLTADNLVLNLQDESFTRGSDSLIKGKK,0,260,261,MAQNLKDLAGRLPAGPRGMGTALKLLLGAGAVAYGVRESVFTVEGGHRAIFFNRIGGVQQDTILAEGLHFRIPWFQYPIIYDIRARPRKISSPTGSKDLQMVNISLRVLSRPNAQELPSMYQRLGLDYEERVLPSIVNEVLKSVVAKFNASQLITQRAQVSLLIRRELTERAKDFSLILDDVAITELSFSREYTAAVEAKQVALSKNPGYIKLRKIRAAQNISKTIATSQNRIYLTADNLVLNLQDESFTRGSDSLIKGKK,29067.73957969,29085.65198,,RESID:49@0,,,1
15334,PHB2_HUMAN,Q99623,Prohibitin-2,Q99623-2,2,MAQNLKDLAGRLPAGPRGMGTALKLLLGAGAVAYGVRESVFTVEGGHRAIFFNRIGGVQQDTILAEGLHFRIPWFQYPIIYDIRARPRKISSPTGSKDLQMVNISLRVLSRPNAQELPSMYQRLGLDYEERVLPSIVNEVLKSVVAKFNASQLITQRAQVSLLIRRELTERAKDFSLILDDVAITELSFSREYTAAVEAKQVALSKNPGYIKLRKIRAAQNISKTIATSQNRIYLTADNLVLNLQDESFTRGSDSLIKGKK,1,260,260,AQNLKDLAGRLPAGPRGMGTALKLLLGAGAVAYGVRESVFTVEGGHRAIFFNRIGGVQQDTILAEGLHFRIPWFQYPIIYDIRARPRKISSPTGSKDLQMVNISLRVLSRPNAQELPSMYQRLGLDYEERVLPSIVNEVLKSVVAKFNASQLITQRAQVSLLIRRELTERAKDFSLILDDVAITELSFSREYTAAVEAKQVALSKNPGYIKLRKIRAAQNISKTIATSQNRIYLTADNLVLNLQDESFTRGSDSLIKGKK,29016.66542069,29034.43938,,RESID:41@0|RESID:39@126,,,1
15335,PHB2_HUMAN,Q99623,Prohibitin-2,Q99623-2,2,MAQNLKDLAGRLPAGPRGMGTALKLLLGAGAVAYGVRESVFTVEGGHRAIFFNRIGGVQQDTILAEGLHFRIPWFQYPIIYDIRARPRKISSPTGSKDLQMVNISLRVLSRPNAQELPSMYQRLGLDYEERVLPSIVNEVLKSVVAKFNASQLITQRAQVSLLIRRELTERAKDFSLILDDVAITELSFSREYTAAVEAKQVALSKNPGYIKLRKIRAAQNISKTIATSQNRIYLTADNLVLNLQDESFTRGSDSLIKGKK,0,260,261,MAQNLKDLAGRLPAGPRGMGTALKLLLGAGAVAYGVRESVFTVEGGHRAIFFNRIGGVQQDTILAEGLHFRIPWFQYPIIYDIRARPRKISSPTGSKDLQMVNISLRVLSRPNAQELPSMYQRLGLDYEERVLPSIVNEVLKSVVAKFNASQLITQRAQVSLLIRRELTERAKDFSLILDDVAITELSFSREYTAAVEAKQVALSKNPGYIKLRKIRAAQNISKTIATSQNRIYLTADNLVLNLQDESFTRGSDSLIKGKK,29189.71647569,29207.67198,,RESID:49@0|RESID:39@127|RESID:55@211,,,1
15336,PHB2_HUMAN,Q99623,Prohibitin-2,Q99623-2,2,MAQNLKDLAGRLPAGPRGMGTALKLLLGAGAVAYGVRESVFTVEGGHRAIFFNRIGGVQQDTILAEGLHFRIPWFQYPIIYDIRARPRKISSPTGSKDLQMVNISLRVLSRPNAQELPSMYQRLGLDYEERVLPSIVNEVLKSVVAKFNASQLITQRAQVSLLIRRELTERAKDFSLILDDVAITELSFSREYTAAVEAKQVALSKNPGYIKLRKIRAAQNISKTIATSQNRIYLTADNLVLNLQDESFTRGSDSLIKGKK,1,260,260,AQNLKDLAGRLPAGPRGMGTALKLLLGAGAVAYGVRESVFTVEGGHRAIFFNRIGGVQQDTILAEGLHFRIPWFQYPIIYDIRARPRKISSPTGSKDLQMVNISLRVLSRPNAQELPSMYQRLGLDYEERVLPSIVNEVLKSVVAKFNASQLITQRAQVSLLIRRELTERAKDFSLILDDVAITELSFSREYTAAVEAKQVALSKNPGYIKLRKIRAAQNISKTIATSQNRIYLTADNLVLNLQDESFTRGSDSLIKGKK,28978.70965469,28996.49938,,RESID:41@0|RESID:55@210,,,1
15337,PHB2_HUMAN,Q99623,Prohibitin-2,Q99623-2,2,MAQNLKDLAGRLPAGPRGMGTALKLLLGAGAVAYGVRESVFTVEGGHRAIFFNRIGGVQQDTILAEGLHFRIPWFQYPIIYDIRARPRKISSPTGSKDLQMVNISLRVLSRPNAQELPSMYQRLGLDYEERVLPSIVNEVLKSVVAKFNASQLITQRAQVSLLIRRELTERAKDFSLILDDVAITELSFSREYTAAVEAKQVALSKNPGYIKLRKIRAAQNISKTIATSQNRIYLTADNLVLNLQDESFTRGSDSLIKGKK,1,260,260,AQNLKDLAGRLPAGPRGMGTALKLLLGAGAVAYGVRESVFTVEGGHRAIFFNRIGGVQQDTILAEGLHFRIPWFQYPIIYDIRARPRKISSPTGSKDLQMVNISLRVLSRPNAQELPSMYQRLGLDYEERVLPSIVNEVLKSVVAKFNASQLITQRAQVSLLIRRELTERAKDFSLILDDVAITELSFSREYTAAVEAKQVALSKNPGYIKLRKIRAAQNISKTIATSQNRIYLTADNLVLNLQDESFTRGSDSLIKGKK,29058.67598569,29076.47938,,RESID:41@0|RESID:39@126|RESID:55@210,,,1
15338,PHB2_HUMAN,Q99623,Prohibitin-2,Q99623-2,2,MAQNLKDLAGRLPAGPRGMGTALKLLLGAGAVAYGVRESVFTVEGGHRAIFFNRIGGVQQDTILAEGLHFRIPWFQYPIIYDIRARPRKISSPTGSKDLQMVNISLRVLSRPNAQELPSMYQRLGLDYEERVLPSIVNEVLKSVVAKFNASQLITQRAQVSLLIRRELTERAKDFSLILDDVAITELSFSREYTAAVEAKQVALSKNPGYIKLRKIRAAQNISKTIATSQNRIYLTADNLVLNLQDESFTRGSDSLIKGKK,0,260,261,MAQNLKDLAGRLPAGPRGMGTALKLLLGAGAVAYGVRESVFTVEGGHRAIFFNRIGGVQQDTILAEGLHFRIPWFQYPIIYDIRARPRKISSPTGSKDLQMVNISLRVLSRPNAQELPSMYQRLGLDYEERVLPSIVNEVLKSVVAKFNASQLITQRAQVSLLIRRELTERAKDFSLILDDVAITELSFSREYTAAVEAKQVALSKNPGYIKLRKIRAAQNISKTIATSQNRIYLTADNLVLNLQDESFTRGSDSLIKGKK,29025.72901469,29043.61198,,,,,1
