PFR,UniProt Id,Entry Accession,Entry Description,Isoform Accession,Isoform Description,Isoform Sequence,Start,End,Length,Proteoform Sequence,Monoisotopic Mass,Average Mass,Sequence Modifications,PTMs,N-Terminal,C-Terminal,Star
8676,SC61B_MOUSE,Q9CQS8,Protein transport protein Sec61 subunit beta,Q9CQS8,,MPGPTPSGTNVGSSGRSPSKAVAARAAGSTVRQRKNASCGTRSAGRTTSAGTGGMWRFYTEDSPGLKVGPVPVLVMSLLFIAAVFMLHIWGKYTRS,1,95,95,PGPTPSGTNVGSSGRSPSKAVAARAAGSTVRQRKNASCGTRSAGRTTSAGTGGMWRFYTEDSPGLKVGPVPVLVMSLLFIAAVFMLHIWGKYTRS,9901.02824568999,9907.24048,,RESID:37@11,,,1
8692,SC61B_MOUSE,Q9CQS8,Protein transport protein Sec61 subunit beta,Q9CQS8,,MPGPTPSGTNVGSSGRSPSKAVAARAAGSTVRQRKNASCGTRSAGRTTSAGTGGMWRFYTEDSPGLKVGPVPVLVMSLLFIAAVFMLHIWGKYTRS,1,95,95,PGPTPSGTNVGSSGRSPSKAVAARAAGSTVRQRKNASCGTRSAGRTTSAGTGGMWRFYTEDSPGLKVGPVPVLVMSLLFIAAVFMLHIWGKYTRS,9901.02824568999,9907.24048,,RESID:37@5,,,1
8755,SC61B_MOUSE,Q9CQS8,Protein transport protein Sec61 subunit beta,Q9CQS8,,MPGPTPSGTNVGSSGRSPSKAVAARAAGSTVRQRKNASCGTRSAGRTTSAGTGGMWRFYTEDSPGLKVGPVPVLVMSLLFIAAVFMLHIWGKYTRS,1,95,95,PGPTPSGTNVGSSGRSPSKAVAARAAGSTVRQRKNASCGTRSAGRTTSAGTGGMWRFYTEDSPGLKVGPVPVLVMSLLFIAAVFMLHIWGKYTRS,9821.06191469,9827.26048,,,,,1
8878,SC61B_MOUSE,Q9CQS8,Protein transport protein Sec61 subunit beta,Q9CQS8,,MPGPTPSGTNVGSSGRSPSKAVAARAAGSTVRQRKNASCGTRSAGRTTSAGTGGMWRFYTEDSPGLKVGPVPVLVMSLLFIAAVFMLHIWGKYTRS,1,95,95,PGPTPSGTNVGSSGRSPSKAVAARAAGSTVRQRKNASCGTRSAGRTTSAGTGGMWRFYTEDSPGLKVGPVPVLVMSLLFIAAVFMLHIWGKYTRS,9901.02824568999,9907.24048,,RESID:38@3,,,1
9223,SC61B_MOUSE,Q9CQS8,Protein transport protein Sec61 subunit beta,Q9CQS8,,MPGPTPSGTNVGSSGRSPSKAVAARAAGSTVRQRKNASCGTRSAGRTTSAGTGGMWRFYTEDSPGLKVGPVPVLVMSLLFIAAVFMLHIWGKYTRS,0,95,96,MPGPTPSGTNVGSSGRSPSKAVAARAAGSTVRQRKNASCGTRSAGRTTSAGTGGMWRFYTEDSPGLKVGPVPVLVMSLLFIAAVFMLHIWGKYTRS,10633.84361769,10640.33308,,RESID:49@0|RESID:38@4|RESID:37@6|RESID:37@12|RESID:37@13|RESID:37@16|RESID:37@18|RESID:37@28|RESID:38@29,,,1
9242,SC61B_MOUSE,Q9CQS8,Protein transport protein Sec61 subunit beta,Q9CQS8,,MPGPTPSGTNVGSSGRSPSKAVAARAAGSTVRQRKNASCGTRSAGRTTSAGTGGMWRFYTEDSPGLKVGPVPVLVMSLLFIAAVFMLHIWGKYTRS,1,95,95,PGPTPSGTNVGSSGRSPSKAVAARAAGSTVRQRKNASCGTRSAGRTTSAGTGGMWRFYTEDSPGLKVGPVPVLVMSLLFIAAVFMLHIWGKYTRS,9980.99457668999,9987.22048,,RESID:37@17|RESID:37@27,,,1
9289,SC61B_MOUSE,Q9CQS8,Protein transport protein Sec61 subunit beta,Q9CQS8,,MPGPTPSGTNVGSSGRSPSKAVAARAAGSTVRQRKNASCGTRSAGRTTSAGTGGMWRFYTEDSPGLKVGPVPVLVMSLLFIAAVFMLHIWGKYTRS,1,95,95,PGPTPSGTNVGSSGRSPSKAVAARAAGSTVRQRKNASCGTRSAGRTTSAGTGGMWRFYTEDSPGLKVGPVPVLVMSLLFIAAVFMLHIWGKYTRS,9901.02824568999,9907.24048,,RESID:37@15,,,1
9317,SC61B_MOUSE,Q9CQS8,Protein transport protein Sec61 subunit beta,Q9CQS8,,MPGPTPSGTNVGSSGRSPSKAVAARAAGSTVRQRKNASCGTRSAGRTTSAGTGGMWRFYTEDSPGLKVGPVPVLVMSLLFIAAVFMLHIWGKYTRS,0,95,96,MPGPTPSGTNVGSSGRSPSKAVAARAAGSTVRQRKNASCGTRSAGRTTSAGTGGMWRFYTEDSPGLKVGPVPVLVMSLLFIAAVFMLHIWGKYTRS,9952.10240468999,9958.45308,,,,,1
9349,SC61B_MOUSE,Q9CQS8,Protein transport protein Sec61 subunit beta,Q9CQS8,,MPGPTPSGTNVGSSGRSPSKAVAARAAGSTVRQRKNASCGTRSAGRTTSAGTGGMWRFYTEDSPGLKVGPVPVLVMSLLFIAAVFMLHIWGKYTRS,0,95,96,MPGPTPSGTNVGSSGRSPSKAVAARAAGSTVRQRKNASCGTRSAGRTTSAGTGGMWRFYTEDSPGLKVGPVPVLVMSLLFIAAVFMLHIWGKYTRS,9994.11296969,10000.49308,,RESID:49@0,,,1
9432,SC61B_MOUSE,Q9CQS8,Protein transport protein Sec61 subunit beta,Q9CQS8,,MPGPTPSGTNVGSSGRSPSKAVAARAAGSTVRQRKNASCGTRSAGRTTSAGTGGMWRFYTEDSPGLKVGPVPVLVMSLLFIAAVFMLHIWGKYTRS,1,95,95,PGPTPSGTNVGSSGRSPSKAVAARAAGSTVRQRKNASCGTRSAGRTTSAGTGGMWRFYTEDSPGLKVGPVPVLVMSLLFIAAVFMLHIWGKYTRS,9863.07247969,9869.30048000001,,RESID:50@0,,,1
9504,SC61B_MOUSE,Q9CQS8,Protein transport protein Sec61 subunit beta,Q9CQS8,,MPGPTPSGTNVGSSGRSPSKAVAARAAGSTVRQRKNASCGTRSAGRTTSAGTGGMWRFYTEDSPGLKVGPVPVLVMSLLFIAAVFMLHIWGKYTRS,0,95,96,MPGPTPSGTNVGSSGRSPSKAVAARAAGSTVRQRKNASCGTRSAGRTTSAGTGGMWRFYTEDSPGLKVGPVPVLVMSLLFIAAVFMLHIWGKYTRS,10154.04563169,10160.45308,,RESID:49@0|RESID:38@4|RESID:37@6,,,1
10298,SC61B_MOUSE,Q9CQS8,Protein transport protein Sec61 subunit beta,Q9CQS8,,MPGPTPSGTNVGSSGRSPSKAVAARAAGSTVRQRKNASCGTRSAGRTTSAGTGGMWRFYTEDSPGLKVGPVPVLVMSLLFIAAVFMLHIWGKYTRS,1,95,95,PGPTPSGTNVGSSGRSPSKAVAARAAGSTVRQRKNASCGTRSAGRTTSAGTGGMWRFYTEDSPGLKVGPVPVLVMSLLFIAAVFMLHIWGKYTRS,10262.90413469,10269.20048,,RESID:50@0|RESID:38@3|RESID:37@5|RESID:37@12|RESID:37@27|RESID:38@28,,,1
10472,SC61B_MOUSE,Q9CQS8,Protein transport protein Sec61 subunit beta,Q9CQS8,,MPGPTPSGTNVGSSGRSPSKAVAARAAGSTVRQRKNASCGTRSAGRTTSAGTGGMWRFYTEDSPGLKVGPVPVLVMSLLFIAAVFMLHIWGKYTRS,1,95,95,PGPTPSGTNVGSSGRSPSKAVAARAAGSTVRQRKNASCGTRSAGRTTSAGTGGMWRFYTEDSPGLKVGPVPVLVMSLLFIAAVFMLHIWGKYTRS,9980.99457668999,9987.22048,,RESID:38@3|RESID:37@5,,,1
10567,SC61B_MOUSE,Q9CQS8,Protein transport protein Sec61 subunit beta,Q9CQS8,,MPGPTPSGTNVGSSGRSPSKAVAARAAGSTVRQRKNASCGTRSAGRTTSAGTGGMWRFYTEDSPGLKVGPVPVLVMSLLFIAAVFMLHIWGKYTRS,0,95,96,MPGPTPSGTNVGSSGRSPSKAVAARAAGSTVRQRKNASCGTRSAGRTTSAGTGGMWRFYTEDSPGLKVGPVPVLVMSLLFIAAVFMLHIWGKYTRS,10032.06873569,10038.43308,,RESID:38@4,,,1
10568,SC61B_MOUSE,Q9CQS8,Protein transport protein Sec61 subunit beta,Q9CQS8,,MPGPTPSGTNVGSSGRSPSKAVAARAAGSTVRQRKNASCGTRSAGRTTSAGTGGMWRFYTEDSPGLKVGPVPVLVMSLLFIAAVFMLHIWGKYTRS,0,95,96,MPGPTPSGTNVGSSGRSPSKAVAARAAGSTVRQRKNASCGTRSAGRTTSAGTGGMWRFYTEDSPGLKVGPVPVLVMSLLFIAAVFMLHIWGKYTRS,10271.96772869,10278.37308,,RESID:38@4|RESID:37@6|RESID:37@18|RESID:38@29,,,1
10588,SC61B_MOUSE,Q9CQS8,Protein transport protein Sec61 subunit beta,Q9CQS8,,MPGPTPSGTNVGSSGRSPSKAVAARAAGSTVRQRKNASCGTRSAGRTTSAGTGGMWRFYTEDSPGLKVGPVPVLVMSLLFIAAVFMLHIWGKYTRS,1,95,95,PGPTPSGTNVGSSGRSPSKAVAARAAGSTVRQRKNASCGTRSAGRTTSAGTGGMWRFYTEDSPGLKVGPVPVLVMSLLFIAAVFMLHIWGKYTRS,10220.89356969,10227.16048,,RESID:38@3|RESID:37@5|RESID:37@12|RESID:37@17|RESID:37@27,,,1
