PFR,UniProt Id,Entry Accession,Entry Description,Isoform Accession,Isoform Description,Isoform Sequence,Start,End,Length,Proteoform Sequence,Monoisotopic Mass,Average Mass,Sequence Modifications,PTMs,N-Terminal,C-Terminal,Star
2196,NUCKS_HUMAN,Q9H1E3,Nuclear ubiquitous casein and cyclin-dependent kinase substrate 1,Q9H1E3-1,1,MSRPVRNRKVVDYSQFQESDDADEDYGRDSGPPTKKIRSSPREAKNKRRSGKNSQEDSEDSEDKDVKTKKDDSHSAEDSEDEKEDHKNVRQQRQAASKAASKQREMLMEDVGSEEEQEEEDEAPFQEKDSGSDEDFLMEDDDDSDYGSSKKKNKKMVKKSKPERKEKKMPKPRLKATVTPSPVKGKGKVGRPTASKASKEKTPSPKEEDEEPESPPEKKTSTSPPPEKSGDEGSEDEAPSGED,1,242,242,SRPVRNRKVVDYSQFQESDDADEDYGRDSGPPTKKIRSSPREAKNKRRSGKNSQEDSEDSEDKDVKTKKDDSHSAEDSEDEKEDHKNVRQQRQAASKAASKQREMLMEDVGSEEEQEEEDEAPFQEKDSGSDEDFLMEDDDDSDYGSSKKKNKKMVKKSKPERKEKKMPKPRLKATVTPSPVKGKGKVGRPTASKASKEKTPSPKEEDEEPESPPEKKTSTSPPPEKSGDEGSEDEAPSGED,27191.0017896899,27207.23098,,RESID:51@0,,,1
2716,NUCKS_HUMAN,Q9H1E3,Nuclear ubiquitous casein and cyclin-dependent kinase substrate 1,Q9H1E3-1,1,MSRPVRNRKVVDYSQFQESDDADEDYGRDSGPPTKKIRSSPREAKNKRRSGKNSQEDSEDSEDKDVKTKKDDSHSAEDSEDEKEDHKNVRQQRQAASKAASKQREMLMEDVGSEEEQEEEDEAPFQEKDSGSDEDFLMEDDDDSDYGSSKKKNKKMVKKSKPERKEKKMPKPRLKATVTPSPVKGKGKVGRPTASKASKEKTPSPKEEDEEPESPPEKKTSTSPPPEKSGDEGSEDEAPSGED,1,242,242,SRPVRNRKVVDYSQFQESDDADEDYGRDSGPPTKKIRSSPREAKNKRRSGKNSQEDSEDSEDKDVKTKKDDSHSAEDSEDEKEDHKNVRQQRQAASKAASKQREMLMEDVGSEEEQEEEDEAPFQEKDSGSDEDFLMEDDDDSDYGSSKKKNKKMVKKSKPERKEKKMPKPRLKATVTPSPVKGKGKVGRPTASKASKEKTPSPKEEDEEPESPPEKKTSTSPPPEKSGDEGSEDEAPSGED,27270.9681206899,27287.21098,,RESID:51@0|RESID:39@24,,,1
2736,NUCKS_HUMAN,Q9H1E3,Nuclear ubiquitous casein and cyclin-dependent kinase substrate 1,Q9H1E3-1,1,MSRPVRNRKVVDYSQFQESDDADEDYGRDSGPPTKKIRSSPREAKNKRRSGKNSQEDSEDSEDKDVKTKKDDSHSAEDSEDEKEDHKNVRQQRQAASKAASKQREMLMEDVGSEEEQEEEDEAPFQEKDSGSDEDFLMEDDDDSDYGSSKKKNKKMVKKSKPERKEKKMPKPRLKATVTPSPVKGKGKVGRPTASKASKEKTPSPKEEDEEPESPPEKKTSTSPPPEKSGDEGSEDEAPSGED,1,242,242,SRPVRNRKVVDYSQFQESDDADEDYGRDSGPPTKKIRSSPREAKNKRRSGKNSQEDSEDSEDKDVKTKKDDSHSAEDSEDEKEDHKNVRQQRQAASKAASKQREMLMEDVGSEEEQEEEDEAPFQEKDSGSDEDFLMEDDDDSDYGSSKKKNKKMVKKSKPERKEKKMPKPRLKATVTPSPVKGKGKVGRPTASKASKEKTPSPKEEDEEPESPPEKKTSTSPPPEKSGDEGSEDEAPSGED,27430.9007826899,27447.17098,,RESID:51@0|RESID:39@24|RESID:37@52|RESID:37@56,,,1
2760,NUCKS_HUMAN,Q9H1E3,Nuclear ubiquitous casein and cyclin-dependent kinase substrate 1,Q9H1E3-1,1,MSRPVRNRKVVDYSQFQESDDADEDYGRDSGPPTKKIRSSPREAKNKRRSGKNSQEDSEDSEDKDVKTKKDDSHSAEDSEDEKEDHKNVRQQRQAASKAASKQREMLMEDVGSEEEQEEEDEAPFQEKDSGSDEDFLMEDDDDSDYGSSKKKNKKMVKKSKPERKEKKMPKPRLKATVTPSPVKGKGKVGRPTASKASKEKTPSPKEEDEEPESPPEKKTSTSPPPEKSGDEGSEDEAPSGED,1,242,242,SRPVRNRKVVDYSQFQESDDADEDYGRDSGPPTKKIRSSPREAKNKRRSGKNSQEDSEDSEDKDVKTKKDDSHSAEDSEDEKEDHKNVRQQRQAASKAASKQREMLMEDVGSEEEQEEEDEAPFQEKDSGSDEDFLMEDDDDSDYGSSKKKNKKMVKKSKPERKEKKMPKPRLKATVTPSPVKGKGKVGRPTASKASKEKTPSPKEEDEEPESPPEKKTSTSPPPEKSGDEGSEDEAPSGED,27350.9344516899,27367.19098,,RESID:51@0|RESID:39@24|RESID:37@238,,,1
2948,NUCKS_HUMAN,Q9H1E3,Nuclear ubiquitous casein and cyclin-dependent kinase substrate 1,Q9H1E3-1,1,MSRPVRNRKVVDYSQFQESDDADEDYGRDSGPPTKKIRSSPREAKNKRRSGKNSQEDSEDSEDKDVKTKKDDSHSAEDSEDEKEDHKNVRQQRQAASKAASKQREMLMEDVGSEEEQEEEDEAPFQEKDSGSDEDFLMEDDDDSDYGSSKKKNKKMVKKSKPERKEKKMPKPRLKATVTPSPVKGKGKVGRPTASKASKEKTPSPKEEDEEPESPPEKKTSTSPPPEKSGDEGSEDEAPSGED,1,242,242,SRPVRNRKVVDYSQFQESDDADEDYGRDSGPPTKKIRSSPREAKNKRRSGKNSQEDSEDSEDKDVKTKKDDSHSAEDSEDEKEDHKNVRQQRQAASKAASKQREMLMEDVGSEEEQEEEDEAPFQEKDSGSDEDFLMEDDDDSDYGSSKKKNKKMVKKSKPERKEKKMPKPRLKATVTPSPVKGKGKVGRPTASKASKEKTPSPKEEDEEPESPPEKKTSTSPPPEKSGDEGSEDEAPSGED,27510.8671136899,27527.15098,,RESID:51@0|RESID:39@24|RESID:37@52|RESID:37@56|RESID:37@238,,,1
3052,NUCKS_HUMAN,Q9H1E3,Nuclear ubiquitous casein and cyclin-dependent kinase substrate 1,Q9H1E3-1,1,MSRPVRNRKVVDYSQFQESDDADEDYGRDSGPPTKKIRSSPREAKNKRRSGKNSQEDSEDSEDKDVKTKKDDSHSAEDSEDEKEDHKNVRQQRQAASKAASKQREMLMEDVGSEEEQEEEDEAPFQEKDSGSDEDFLMEDDDDSDYGSSKKKNKKMVKKSKPERKEKKMPKPRLKATVTPSPVKGKGKVGRPTASKASKEKTPSPKEEDEEPESPPEKKTSTSPPPEKSGDEGSEDEAPSGED,1,242,242,SRPVRNRKVVDYSQFQESDDADEDYGRDSGPPTKKIRSSPREAKNKRRSGKNSQEDSEDSEDKDVKTKKDDSHSAEDSEDEKEDHKNVRQQRQAASKAASKQREMLMEDVGSEEEQEEEDEAPFQEKDSGSDEDFLMEDDDDSDYGSSKKKNKKMVKKSKPERKEKKMPKPRLKATVTPSPVKGKGKVGRPTASKASKEKTPSPKEEDEEPESPPEKKTSTSPPPEKSGDEGSEDEAPSGED,27830.7324376899,27847.07098,,RESID:51@0|RESID:39@24|RESID:37@52|RESID:37@56|RESID:38@200|RESID:37@212|RESID:37@227|RESID:37@232|RESID:37@238,,,1
3098,NUCKS_HUMAN,Q9H1E3,Nuclear ubiquitous casein and cyclin-dependent kinase substrate 1,Q9H1E3-1,1,MSRPVRNRKVVDYSQFQESDDADEDYGRDSGPPTKKIRSSPREAKNKRRSGKNSQEDSEDSEDKDVKTKKDDSHSAEDSEDEKEDHKNVRQQRQAASKAASKQREMLMEDVGSEEEQEEEDEAPFQEKDSGSDEDFLMEDDDDSDYGSSKKKNKKMVKKSKPERKEKKMPKPRLKATVTPSPVKGKGKVGRPTASKASKEKTPSPKEEDEEPESPPEKKTSTSPPPEKSGDEGSEDEAPSGED,1,242,242,SRPVRNRKVVDYSQFQESDDADEDYGRDSGPPTKKIRSSPREAKNKRRSGKNSQEDSEDSEDKDVKTKKDDSHSAEDSEDEKEDHKNVRQQRQAASKAASKQREMLMEDVGSEEEQEEEDEAPFQEKDSGSDEDFLMEDDDDSDYGSSKKKNKKMVKKSKPERKEKKMPKPRLKATVTPSPVKGKGKVGRPTASKASKEKTPSPKEEDEEPESPPEKKTSTSPPPEKSGDEGSEDEAPSGED,27510.8671136899,27527.15098,,RESID:51@0|RESID:39@24|RESID:37@52|RESID:37@56|RESID:37@227,,,1
3198,NUCKS_HUMAN,Q9H1E3,Nuclear ubiquitous casein and cyclin-dependent kinase substrate 1,Q9H1E3-1,1,MSRPVRNRKVVDYSQFQESDDADEDYGRDSGPPTKKIRSSPREAKNKRRSGKNSQEDSEDSEDKDVKTKKDDSHSAEDSEDEKEDHKNVRQQRQAASKAASKQREMLMEDVGSEEEQEEEDEAPFQEKDSGSDEDFLMEDDDDSDYGSSKKKNKKMVKKSKPERKEKKMPKPRLKATVTPSPVKGKGKVGRPTASKASKEKTPSPKEEDEEPESPPEKKTSTSPPPEKSGDEGSEDEAPSGED,1,242,242,SRPVRNRKVVDYSQFQESDDADEDYGRDSGPPTKKIRSSPREAKNKRRSGKNSQEDSEDSEDKDVKTKKDDSHSAEDSEDEKEDHKNVRQQRQAASKAASKQREMLMEDVGSEEEQEEEDEAPFQEKDSGSDEDFLMEDDDDSDYGSSKKKNKKMVKKSKPERKEKKMPKPRLKATVTPSPVKGKGKVGRPTASKASKEKTPSPKEEDEEPESPPEKKTSTSPPPEKSGDEGSEDEAPSGED,28070.6314306899,28087.01098,,RESID:51@0|RESID:37@17|RESID:39@24|RESID:37@52|RESID:37@56|RESID:38@200|RESID:37@202|RESID:37@212|RESID:37@221|RESID:37@227|RESID:37@232|RESID:37@238,,,1
3314,NUCKS_HUMAN,Q9H1E3,Nuclear ubiquitous casein and cyclin-dependent kinase substrate 1,Q9H1E3-1,1,MSRPVRNRKVVDYSQFQESDDADEDYGRDSGPPTKKIRSSPREAKNKRRSGKNSQEDSEDSEDKDVKTKKDDSHSAEDSEDEKEDHKNVRQQRQAASKAASKQREMLMEDVGSEEEQEEEDEAPFQEKDSGSDEDFLMEDDDDSDYGSSKKKNKKMVKKSKPERKEKKMPKPRLKATVTPSPVKGKGKVGRPTASKASKEKTPSPKEEDEEPESPPEKKTSTSPPPEKSGDEGSEDEAPSGED,1,242,242,SRPVRNRKVVDYSQFQESDDADEDYGRDSGPPTKKIRSSPREAKNKRRSGKNSQEDSEDSEDKDVKTKKDDSHSAEDSEDEKEDHKNVRQQRQAASKAASKQREMLMEDVGSEEEQEEEDEAPFQEKDSGSDEDFLMEDDDDSDYGSSKKKNKKMVKKSKPERKEKKMPKPRLKATVTPSPVKGKGKVGRPTASKASKEKTPSPKEEDEEPESPPEKKTSTSPPPEKSGDEGSEDEAPSGED,27670.7997756899,27687.11098,,RESID:51@0|RESID:39@24|RESID:37@52|RESID:37@56|RESID:37@212|RESID:37@227|RESID:37@232,,,1
3486,NUCKS_HUMAN,Q9H1E3,Nuclear ubiquitous casein and cyclin-dependent kinase substrate 1,Q9H1E3-1,1,MSRPVRNRKVVDYSQFQESDDADEDYGRDSGPPTKKIRSSPREAKNKRRSGKNSQEDSEDSEDKDVKTKKDDSHSAEDSEDEKEDHKNVRQQRQAASKAASKQREMLMEDVGSEEEQEEEDEAPFQEKDSGSDEDFLMEDDDDSDYGSSKKKNKKMVKKSKPERKEKKMPKPRLKATVTPSPVKGKGKVGRPTASKASKEKTPSPKEEDEEPESPPEKKTSTSPPPEKSGDEGSEDEAPSGED,1,242,242,SRPVRNRKVVDYSQFQESDDADEDYGRDSGPPTKKIRSSPREAKNKRRSGKNSQEDSEDSEDKDVKTKKDDSHSAEDSEDEKEDHKNVRQQRQAASKAASKQREMLMEDVGSEEEQEEEDEAPFQEKDSGSDEDFLMEDDDDSDYGSSKKKNKKMVKKSKPERKEKKMPKPRLKATVTPSPVKGKGKVGRPTASKASKEKTPSPKEEDEEPESPPEKKTSTSPPPEKSGDEGSEDEAPSGED,27590.8334446899,27607.13098,,RESID:51@0|RESID:39@24|RESID:37@52|RESID:37@56|RESID:37@221|RESID:37@232,,,1
3846,NUCKS_HUMAN,Q9H1E3,Nuclear ubiquitous casein and cyclin-dependent kinase substrate 1,Q9H1E3-1,1,MSRPVRNRKVVDYSQFQESDDADEDYGRDSGPPTKKIRSSPREAKNKRRSGKNSQEDSEDSEDKDVKTKKDDSHSAEDSEDEKEDHKNVRQQRQAASKAASKQREMLMEDVGSEEEQEEEDEAPFQEKDSGSDEDFLMEDDDDSDYGSSKKKNKKMVKKSKPERKEKKMPKPRLKATVTPSPVKGKGKVGRPTASKASKEKTPSPKEEDEEPESPPEKKTSTSPPPEKSGDEGSEDEAPSGED,1,242,242,SRPVRNRKVVDYSQFQESDDADEDYGRDSGPPTKKIRSSPREAKNKRRSGKNSQEDSEDSEDKDVKTKKDDSHSAEDSEDEKEDHKNVRQQRQAASKAASKQREMLMEDVGSEEEQEEEDEAPFQEKDSGSDEDFLMEDDDDSDYGSSKKKNKKMVKKSKPERKEKKMPKPRLKATVTPSPVKGKGKVGRPTASKASKEKTPSPKEEDEEPESPPEKKTSTSPPPEKSGDEGSEDEAPSGED,27990.6650996899,28007.03098,,RESID:51@0|RESID:37@17|RESID:39@24|RESID:37@52|RESID:37@56|RESID:38@200|RESID:37@202|RESID:37@212|RESID:37@221|RESID:37@227|RESID:37@232,,,1
14151,NUCKS_HUMAN,Q9H1E3,Nuclear ubiquitous casein and cyclin-dependent kinase substrate 1,Q9H1E3-1,1,MSRPVRNRKVVDYSQFQESDDADEDYGRDSGPPTKKIRSSPREAKNKRRSGKNSQEDSEDSEDKDVKTKKDDSHSAEDSEDEKEDHKNVRQQRQAASKAASKQREMLMEDVGSEEEQEEEDEAPFQEKDSGSDEDFLMEDDDDSDYGSSKKKNKKMVKKSKPERKEKKMPKPRLKATVTPSPVKGKGKVGRPTASKASKEKTPSPKEEDEEPESPPEKKTSTSPPPEKSGDEGSEDEAPSGED,1,242,242,SRPVRNRKVVDYSQFQESDDADEDYGRDSGPPTKKIRSSPREAKNKRRSGKNSQEDSEDSEDKDVKTKKDDSHSAEDSEDEKEDHKNVRQQRQAASKAASKQREMLMEDVGSEEEQEEEDEAPFQEKDSGSDEDFPMEDDDDSDYGSSKKKNKKMVKKSKPERKEKKMPKPRLKATVTPSPVKGKGKVGRPTASKASKEKTPSPKEEDEEPESPPEKKTSTSPPPEKSGDEGSEDEAPSGED,27494.8358136899,27511.10828,PSI-MOD:24@136,RESID:51@0|RESID:37@17|RESID:39@24|RESID:37@202|RESID:37@238,,,1
14172,NUCKS_HUMAN,Q9H1E3,Nuclear ubiquitous casein and cyclin-dependent kinase substrate 1,Q9H1E3-1,1,MSRPVRNRKVVDYSQFQESDDADEDYGRDSGPPTKKIRSSPREAKNKRRSGKNSQEDSEDSEDKDVKTKKDDSHSAEDSEDEKEDHKNVRQQRQAASKAASKQREMLMEDVGSEEEQEEEDEAPFQEKDSGSDEDFLMEDDDDSDYGSSKKKNKKMVKKSKPERKEKKMPKPRLKATVTPSPVKGKGKVGRPTASKASKEKTPSPKEEDEEPESPPEKKTSTSPPPEKSGDEGSEDEAPSGED,1,242,242,SRPVRNRKVVDYSQFQESDDADEDYGRDSGPPTKKIRSSPREAKNKRRSGKNSQEDSEDSEDKDVKTKKDDSHSAEDSEDEKEDHKNVRQQRQAASKAASKQREMLMEDVGSEEEQEEEDEAPFQEKDSGSDEDFPMEDDDDSDYGSSKKKNKKMVKKSKPERKEKKMPKPRLKATVTPSPVKGKGKVGRPTASKASKEKTPSPKEEDEEPESPPEKKTSTSPPPEKSGDEGSEDEAPSGED,27414.8694826899,27431.12828,PSI-MOD:24@136,RESID:51@0|RESID:37@17|RESID:37@221|RESID:37@238,,,1
14188,NUCKS_HUMAN,Q9H1E3,Nuclear ubiquitous casein and cyclin-dependent kinase substrate 1,Q9H1E3-1,1,MSRPVRNRKVVDYSQFQESDDADEDYGRDSGPPTKKIRSSPREAKNKRRSGKNSQEDSEDSEDKDVKTKKDDSHSAEDSEDEKEDHKNVRQQRQAASKAASKQREMLMEDVGSEEEQEEEDEAPFQEKDSGSDEDFLMEDDDDSDYGSSKKKNKKMVKKSKPERKEKKMPKPRLKATVTPSPVKGKGKVGRPTASKASKEKTPSPKEEDEEPESPPEKKTSTSPPPEKSGDEGSEDEAPSGED,1,242,242,SRPVRNRKVVDYSQFQESDDADEDYGRDSGPPTKKIRSSPREAKNKRRSGKNSQEDSEDSEDKDVKTKKDDSHSAEDSEDEKEDHKNVRQQRQAASKAASKQREMLMEDVGSEEEQEEEDEAPFQEKDSGSDEDFPMEDDDDSDYGSSKKKNKKMVKKSKPERKEKKMPKPRLKATVTPSPVKGKGKVGRPTASKASKEKTPSPKEEDEEPESPPEKKTSTSPPPEKSGDEGSEDEAPSGED,27334.9031516899,27351.14828,PSI-MOD:24@136,RESID:51@0|RESID:37@227|RESID:37@238,,,1
14189,NUCKS_HUMAN,Q9H1E3,Nuclear ubiquitous casein and cyclin-dependent kinase substrate 1,Q9H1E3-1,1,MSRPVRNRKVVDYSQFQESDDADEDYGRDSGPPTKKIRSSPREAKNKRRSGKNSQEDSEDSEDKDVKTKKDDSHSAEDSEDEKEDHKNVRQQRQAASKAASKQREMLMEDVGSEEEQEEEDEAPFQEKDSGSDEDFLMEDDDDSDYGSSKKKNKKMVKKSKPERKEKKMPKPRLKATVTPSPVKGKGKVGRPTASKASKEKTPSPKEEDEEPESPPEKKTSTSPPPEKSGDEGSEDEAPSGED,1,242,242,SRPVRNRKVVDYSQFQESDDADEDYGRDSGPPTKKIRSSPREAKNKRRSGKNSQEDSEDSEDKDVKTKKDDSHSAEDSEDEKEDHKNVRQQRQAASKAASKQREMLMEDVGSEEEQEGEDEAPFQEKDSGSDEDFLMEDDDDSDYGSSKKKNKKMVKKSKPERKEKKMPKPRLKATVTPSPVKGKGKVGRPTASKASKEKTPSPKEEDEEPESPPEKKTSTSPPPEKSGDEGSEDEAPSGED,27278.9133216899,27295.12738,PSI-MOD:17@118,RESID:51@0|RESID:37@202|RESID:37@212,,,1
14190,NUCKS_HUMAN,Q9H1E3,Nuclear ubiquitous casein and cyclin-dependent kinase substrate 1,Q9H1E3-1,1,MSRPVRNRKVVDYSQFQESDDADEDYGRDSGPPTKKIRSSPREAKNKRRSGKNSQEDSEDSEDKDVKTKKDDSHSAEDSEDEKEDHKNVRQQRQAASKAASKQREMLMEDVGSEEEQEEEDEAPFQEKDSGSDEDFLMEDDDDSDYGSSKKKNKKMVKKSKPERKEKKMPKPRLKATVTPSPVKGKGKVGRPTASKASKEKTPSPKEEDEEPESPPEKKTSTSPPPEKSGDEGSEDEAPSGED,1,242,242,SRPVRNRKVVDYSQFQESDDADEDYGRDSGPPTKKIRSSPREAKNKRRSGKNSQEDSEDSEDKDVKTKKDDSHSAEDSEDEKEDHKNVRQQRQAASKAASKQREMLMEDVGSEEEQEEEDEAPFQEKDSGSDEDFPMEDDDDSDYGSSKKKNKKMVKKSKPERKEKKMPKPRLKATVTPSPVKGKGKVGRPTASKASKEKTPSPKEEDEEPESPPEKKTSTSPPPEKSGDEGSEDEAPSGED,27574.8021446899,27591.08828,PSI-MOD:24@136,RESID:51@0|RESID:37@17|RESID:39@24|RESID:37@202|RESID:37@212|RESID:37@238,,,1
14242,NUCKS_HUMAN,Q9H1E3,Nuclear ubiquitous casein and cyclin-dependent kinase substrate 1,Q9H1E3-1,1,MSRPVRNRKVVDYSQFQESDDADEDYGRDSGPPTKKIRSSPREAKNKRRSGKNSQEDSEDSEDKDVKTKKDDSHSAEDSEDEKEDHKNVRQQRQAASKAASKQREMLMEDVGSEEEQEEEDEAPFQEKDSGSDEDFLMEDDDDSDYGSSKKKNKKMVKKSKPERKEKKMPKPRLKATVTPSPVKGKGKVGRPTASKASKEKTPSPKEEDEEPESPPEKKTSTSPPPEKSGDEGSEDEAPSGED,1,242,242,SRPVRNRKVVDYSQFQESDDADEDYGRDSGPPTKKIRSSPREAKNKRRSGKNSQEDSEDSEDKDVKTKKDDSHSAEDSEDEKEDHKNVRQQRQAASKAASKQREMLMEDVGSEEEQEEEDEAPFQEKDSGSDEDFPMEDDDDSDYGSSKKKNKKMVKKSKPERKEKKMPKPRLKATVTPSPVKGKGKVGRPTASKASKEKTPSPKEEDEEPESPPEKKTSTSPPPEKSGDEGSEDEAPSGED,27414.8694826899,27431.12828,PSI-MOD:24@136,RESID:51@0|RESID:37@17|RESID:39@24|RESID:37@202,,,1
14243,NUCKS_HUMAN,Q9H1E3,Nuclear ubiquitous casein and cyclin-dependent kinase substrate 1,Q9H1E3-1,1,MSRPVRNRKVVDYSQFQESDDADEDYGRDSGPPTKKIRSSPREAKNKRRSGKNSQEDSEDSEDKDVKTKKDDSHSAEDSEDEKEDHKNVRQQRQAASKAASKQREMLMEDVGSEEEQEEEDEAPFQEKDSGSDEDFLMEDDDDSDYGSSKKKNKKMVKKSKPERKEKKMPKPRLKATVTPSPVKGKGKVGRPTASKASKEKTPSPKEEDEEPESPPEKKTSTSPPPEKSGDEGSEDEAPSGED,1,242,242,SRPVRNRKVVDYSQFQESDDADEDYGRDSGPPTKKIRSSPREAKNKRRSGKNSQEDSEDSEDKDVKTKKDDSHSAEDSEDEKEDHKNVRQQRQAASKAASKQREMLMEDVGSEEEQEGEDEAPFQEKDSGSDEDFLMEDDDDSDYGSSKKKNKKMVKKSKPERKEKKMPKPRLKATVTPSPVKGKGKVGRPTASKASKEKTPSPKEEDEEPESPPEKKTSTSPPPEKSGDEGSEDEAPSGED,27438.8459836899,27455.08738,PSI-MOD:17@118,RESID:51@0|RESID:37@17|RESID:39@24|RESID:37@202|RESID:37@238,,,1
14244,NUCKS_HUMAN,Q9H1E3,Nuclear ubiquitous casein and cyclin-dependent kinase substrate 1,Q9H1E3-1,1,MSRPVRNRKVVDYSQFQESDDADEDYGRDSGPPTKKIRSSPREAKNKRRSGKNSQEDSEDSEDKDVKTKKDDSHSAEDSEDEKEDHKNVRQQRQAASKAASKQREMLMEDVGSEEEQEEEDEAPFQEKDSGSDEDFLMEDDDDSDYGSSKKKNKKMVKKSKPERKEKKMPKPRLKATVTPSPVKGKGKVGRPTASKASKEKTPSPKEEDEEPESPPEKKTSTSPPPEKSGDEGSEDEAPSGED,1,242,242,SRPVRNRKVVDYSQFQESDDADEDYGRDSGPPTKKIRSSPREAKNKRRSGKNSQEDSEDSEDKDVKTKKDDSHSAEDSEDEKEDHKNVRQQRQAASKAASKQREMLMEDVGSEEEQEEEDEAPFQEKDSGSDEDFPMEDDDDSDYGSSKKKNKKMVKKSKPERKEKKMPKPRLKATVTPSPVKGKGKVGRPTASKASKEKTPSPKEEDEEPESPPEKKTSTSPPPEKSGDEGSEDEAPSGED,27494.8358136899,27511.10828,PSI-MOD:24@136,RESID:51@0|RESID:37@17|RESID:37@202|RESID:37@212|RESID:37@238,,,1
14245,NUCKS_HUMAN,Q9H1E3,Nuclear ubiquitous casein and cyclin-dependent kinase substrate 1,Q9H1E3-1,1,MSRPVRNRKVVDYSQFQESDDADEDYGRDSGPPTKKIRSSPREAKNKRRSGKNSQEDSEDSEDKDVKTKKDDSHSAEDSEDEKEDHKNVRQQRQAASKAASKQREMLMEDVGSEEEQEEEDEAPFQEKDSGSDEDFLMEDDDDSDYGSSKKKNKKMVKKSKPERKEKKMPKPRLKATVTPSPVKGKGKVGRPTASKASKEKTPSPKEEDEEPESPPEKKTSTSPPPEKSGDEGSEDEAPSGED,1,242,242,SRPVRNRKVVDYSQFQESDDADEDYGRDSGPPTKKIRSSPREAKNKRRSGKNSQEDSEDSEDKDVKTKKDDSHSAEDSEDEKEDHKNVRQQRQAASKAASKQREMLMEDVGSEEEQEEEDEAPFQEKDSGSDEDFPMEDDDDSDYGSSKKKNKKMVKKSKPERKEKKMPKPRLKATVTPSPVKGKGKVGRPTASKASKEKTPSPKEEDEEPESPPEKKTSTSPPPEKSGDEGSEDEAPSGED,27414.8694826899,27431.12828,PSI-MOD:24@136,RESID:51@0|RESID:37@17|RESID:37@212|RESID:37@238,,,1
14246,NUCKS_HUMAN,Q9H1E3,Nuclear ubiquitous casein and cyclin-dependent kinase substrate 1,Q9H1E3-1,1,MSRPVRNRKVVDYSQFQESDDADEDYGRDSGPPTKKIRSSPREAKNKRRSGKNSQEDSEDSEDKDVKTKKDDSHSAEDSEDEKEDHKNVRQQRQAASKAASKQREMLMEDVGSEEEQEEEDEAPFQEKDSGSDEDFLMEDDDDSDYGSSKKKNKKMVKKSKPERKEKKMPKPRLKATVTPSPVKGKGKVGRPTASKASKEKTPSPKEEDEEPESPPEKKTSTSPPPEKSGDEGSEDEAPSGED,1,242,242,SRPVRNRKVVDYSQFQESDDADEDYGRDSGPPTKKIRSSPREAKNKRRSGKNSQEDSEDSEDKDVKTKKDDSHSAEDSEDEKEDHKNVRQQRQAASKAASKQREMLMEDVGSEEEQEEEDEAPFQEKDSGSDEDFLMEDDDDSDYGSSKKKNKKMVKKSKPERKEKKMPKPRLKATVTPSPVKGKGKVGRPTASKASKEKTPSPKEEDEEPESPPEKKTSTSPPPEKSGDEGSEDEAPSGED,27430.9007826899,27447.17098,,RESID:51@0|RESID:37@17|RESID:37@221|RESID:37@238,,,1
14247,NUCKS_HUMAN,Q9H1E3,Nuclear ubiquitous casein and cyclin-dependent kinase substrate 1,Q9H1E3-1,1,MSRPVRNRKVVDYSQFQESDDADEDYGRDSGPPTKKIRSSPREAKNKRRSGKNSQEDSEDSEDKDVKTKKDDSHSAEDSEDEKEDHKNVRQQRQAASKAASKQREMLMEDVGSEEEQEEEDEAPFQEKDSGSDEDFLMEDDDDSDYGSSKKKNKKMVKKSKPERKEKKMPKPRLKATVTPSPVKGKGKVGRPTASKASKEKTPSPKEEDEEPESPPEKKTSTSPPPEKSGDEGSEDEAPSGED,1,242,242,SRPVRNRKVVDYSQFQESDDADEDYGRDSGPPTKKIRSSPREAKNKRRSGKNSQEDSEDSEDKDVKTKKDDSHSAEDSEDEKEDHKNVRQQRQAASKAASKQREMLMEDVGSEEEQEGEDEAPFQEKDSGSDEDFLMEDDDDSDYGSSKKKNKKMVKKSKPERKEKKMPKPRLKATVTPSPVKGKGKVGRPTASKASKEKTPSPKEEDEEPESPPEKKTSTSPPPEKSGDEGSEDEAPSGED,27358.8796526899,27375.10738,PSI-MOD:17@118,RESID:51@0|RESID:39@24|RESID:37@202|RESID:37@238,,,1
14356,NUCKS_HUMAN,Q9H1E3,Nuclear ubiquitous casein and cyclin-dependent kinase substrate 1,Q9H1E3-1,1,MSRPVRNRKVVDYSQFQESDDADEDYGRDSGPPTKKIRSSPREAKNKRRSGKNSQEDSEDSEDKDVKTKKDDSHSAEDSEDEKEDHKNVRQQRQAASKAASKQREMLMEDVGSEEEQEEEDEAPFQEKDSGSDEDFLMEDDDDSDYGSSKKKNKKMVKKSKPERKEKKMPKPRLKATVTPSPVKGKGKVGRPTASKASKEKTPSPKEEDEEPESPPEKKTSTSPPPEKSGDEGSEDEAPSGED,1,242,242,SRPVRNRKVVDYSQFQESDDADEDYGRDSGPPTKKIRSSPREAKNKRRSGKNSQEDSEDSEDKDVKTKKDDSHSAEDSEDEKEDHKNVRQQRQAASKAASKQREMLMEDVGSEEEQEEEDEAPFQEKDSGSDEDFLMEDDDDSDYGSSKKKNKKMVKKSKPERKEKKMPKPRLKATVTPSPVKGKGKVGRPTASKASKEKTPSPKEEDEEPESPPEKKTSTSPPPEKSGDEGSEDEAPSGED,27750.7661066899,27767.09098,,RESID:51@0|RESID:37@17|RESID:39@24|RESID:37@202|RESID:37@212|RESID:37@221|RESID:37@227|RESID:37@238,,,1
14357,NUCKS_HUMAN,Q9H1E3,Nuclear ubiquitous casein and cyclin-dependent kinase substrate 1,Q9H1E3-1,1,MSRPVRNRKVVDYSQFQESDDADEDYGRDSGPPTKKIRSSPREAKNKRRSGKNSQEDSEDSEDKDVKTKKDDSHSAEDSEDEKEDHKNVRQQRQAASKAASKQREMLMEDVGSEEEQEEEDEAPFQEKDSGSDEDFLMEDDDDSDYGSSKKKNKKMVKKSKPERKEKKMPKPRLKATVTPSPVKGKGKVGRPTASKASKEKTPSPKEEDEEPESPPEKKTSTSPPPEKSGDEGSEDEAPSGED,1,242,242,SRPVRNRKVVDYSQFQESDDADEDYGRDSGPPTKKIRSSPREAKNKRRSGKNSQEDSEDSEDKDVKTKKDDSHSAEDSEDEKEDHKNVRQQRQAASKAASKQREMLMEDVGSEEEQEEEDEAPFQEKDSGSDEDFLMEDDDDSDYGSSKKKNKKMVKKSKPERKEKKMPKPRLKATVTPSPVKGKGKVGRPTASKASKEKTPSPKEEDEEPESPPEKKTSTSPPPEKSGDEGSEDEAPSGED,27430.9007826899,27447.17098,,RESID:51@0|RESID:37@17|RESID:37@202|RESID:37@238,,,1
14358,NUCKS_HUMAN,Q9H1E3,Nuclear ubiquitous casein and cyclin-dependent kinase substrate 1,Q9H1E3-1,1,MSRPVRNRKVVDYSQFQESDDADEDYGRDSGPPTKKIRSSPREAKNKRRSGKNSQEDSEDSEDKDVKTKKDDSHSAEDSEDEKEDHKNVRQQRQAASKAASKQREMLMEDVGSEEEQEEEDEAPFQEKDSGSDEDFLMEDDDDSDYGSSKKKNKKMVKKSKPERKEKKMPKPRLKATVTPSPVKGKGKVGRPTASKASKEKTPSPKEEDEEPESPPEKKTSTSPPPEKSGDEGSEDEAPSGED,1,242,242,SRPVRNRKVVDYSQFQESDDADEDYGRDSGPPTKKIRSSPREAKNKRRSGKNSQEDSEDSEDKDVKTKKDDSHSAEDSEDEKEDHKNVRQQRQAASKAASKQREMLMEDVGSEEEQEGEDEAPFQEKDSGSDEDFLMEDDDDSDYGSSKKKNKKMVKKSKPERKEKKMPKPRLKATVTPSPVKGKGKVGRPTASKASKEKTPSPKEEDEEPESPPEKKTSTSPPPEKSGDEGSEDEAPSGED,27198.9469906899,27215.14738,PSI-MOD:17@118,RESID:51@0|RESID:37@238,,,1
14359,NUCKS_HUMAN,Q9H1E3,Nuclear ubiquitous casein and cyclin-dependent kinase substrate 1,Q9H1E3-1,1,MSRPVRNRKVVDYSQFQESDDADEDYGRDSGPPTKKIRSSPREAKNKRRSGKNSQEDSEDSEDKDVKTKKDDSHSAEDSEDEKEDHKNVRQQRQAASKAASKQREMLMEDVGSEEEQEEEDEAPFQEKDSGSDEDFLMEDDDDSDYGSSKKKNKKMVKKSKPERKEKKMPKPRLKATVTPSPVKGKGKVGRPTASKASKEKTPSPKEEDEEPESPPEKKTSTSPPPEKSGDEGSEDEAPSGED,1,242,242,SRPVRNRKVVDYSQFQESDDADEDYGRDSGPPTKKIRSSPREAKNKRRSGKNSQEDSEDSEDKDVKTKKDDSHSAEDSEDEKEDHKNVRQQRQAASKAASKQREMLMEDVGSEEEQEEEDEAPFQEKDSGSDEDFLMEDDDDSDYGSSKKKNKKMVKKSKPERKEKKMPKPRLKATVTPSPVKGKGKVGRPTASKASKEKTPSPKEEDEEPESPPEKKTSTSPPPEKSGDEGSEDEAPSGED,27350.9344516899,27367.19098,,RESID:51@0|RESID:37@227|RESID:37@238,,,1
14384,NUCKS_HUMAN,Q9H1E3,Nuclear ubiquitous casein and cyclin-dependent kinase substrate 1,Q9H1E3-1,1,MSRPVRNRKVVDYSQFQESDDADEDYGRDSGPPTKKIRSSPREAKNKRRSGKNSQEDSEDSEDKDVKTKKDDSHSAEDSEDEKEDHKNVRQQRQAASKAASKQREMLMEDVGSEEEQEEEDEAPFQEKDSGSDEDFLMEDDDDSDYGSSKKKNKKMVKKSKPERKEKKMPKPRLKATVTPSPVKGKGKVGRPTASKASKEKTPSPKEEDEEPESPPEKKTSTSPPPEKSGDEGSEDEAPSGED,1,242,242,SRPVRNRKVVDYSQFQESDDADEDYGRDSGPPTKKIRSSPREAKNKRRSGKNSQEDSEDSEDKDVKTKKDDSHSAEDSEDEKEDHKNVRQQRQAASKAASKQREMLMEDVGSEEEQEEEDEAPFQEKDSGSDEDFPMEDDDDSDYGSSKKKNKKMVKKSKPERKEKKMPKPRLKATVTPSPVKGKGKVGRPTASKASKEKTPSPKEEDEEPESPPEKKTSTSPPPEKSGDEGSEDEAPSGED,27654.7684756899,27671.06828,PSI-MOD:24@136,RESID:51@0|RESID:37@17|RESID:39@24|RESID:37@202|RESID:37@212|RESID:37@221|RESID:37@227,,,1
14385,NUCKS_HUMAN,Q9H1E3,Nuclear ubiquitous casein and cyclin-dependent kinase substrate 1,Q9H1E3-1,1,MSRPVRNRKVVDYSQFQESDDADEDYGRDSGPPTKKIRSSPREAKNKRRSGKNSQEDSEDSEDKDVKTKKDDSHSAEDSEDEKEDHKNVRQQRQAASKAASKQREMLMEDVGSEEEQEEEDEAPFQEKDSGSDEDFLMEDDDDSDYGSSKKKNKKMVKKSKPERKEKKMPKPRLKATVTPSPVKGKGKVGRPTASKASKEKTPSPKEEDEEPESPPEKKTSTSPPPEKSGDEGSEDEAPSGED,1,242,242,SRPVRNRKVVDYSQFQESDDADEDYGRDSGPPTKKIRSSPREAKNKRRSGKNSQEDSEDSEDKDVKTKKDDSHSAEDSEDEKEDHKNVRQQRQAASKAASKQREMLMEDVGSEEEQEGEDEAPFQEKDSGSDEDFLMEDDDDSDYGSSKKKNKKMVKKSKPERKEKKMPKPRLKATVTPSPVKGKGKVGRPTASKASKEKTPSPKEEDEEPESPPEKKTSTSPPPEKSGDEGSEDEAPSGED,27358.8796526899,27375.10738,PSI-MOD:17@118,RESID:51@0|RESID:37@17|RESID:37@221|RESID:37@238,,,1
14386,NUCKS_HUMAN,Q9H1E3,Nuclear ubiquitous casein and cyclin-dependent kinase substrate 1,Q9H1E3-1,1,MSRPVRNRKVVDYSQFQESDDADEDYGRDSGPPTKKIRSSPREAKNKRRSGKNSQEDSEDSEDKDVKTKKDDSHSAEDSEDEKEDHKNVRQQRQAASKAASKQREMLMEDVGSEEEQEEEDEAPFQEKDSGSDEDFLMEDDDDSDYGSSKKKNKKMVKKSKPERKEKKMPKPRLKATVTPSPVKGKGKVGRPTASKASKEKTPSPKEEDEEPESPPEKKTSTSPPPEKSGDEGSEDEAPSGED,1,242,242,SRPVRNRKVVDYSQFQESDDADEDYGRDSGPPTKKIRSSPREAKNKRRSGKNSQEDSEDSEDKDVKTKKDDSHSAEDSEDEKEDHKNVRQQRQAASKAASKQREMLMEDVGSEEEQEEEDEAPFQEKDSGSDEDFLMEDDDDSDYGSSKKKNKKMVKKSKPERKEKKMPKPRLKATVTPSPVKGKGKVGRPTASKASKEKTPSPKEEDEEPESPPEKKTSTSPPPEKSGDEGSEDEAPSGED,27670.7997756899,27687.11098,,RESID:51@0|RESID:37@17|RESID:39@24|RESID:37@202|RESID:37@212|RESID:37@221|RESID:37@238,,,1
14387,NUCKS_HUMAN,Q9H1E3,Nuclear ubiquitous casein and cyclin-dependent kinase substrate 1,Q9H1E3-1,1,MSRPVRNRKVVDYSQFQESDDADEDYGRDSGPPTKKIRSSPREAKNKRRSGKNSQEDSEDSEDKDVKTKKDDSHSAEDSEDEKEDHKNVRQQRQAASKAASKQREMLMEDVGSEEEQEEEDEAPFQEKDSGSDEDFLMEDDDDSDYGSSKKKNKKMVKKSKPERKEKKMPKPRLKATVTPSPVKGKGKVGRPTASKASKEKTPSPKEEDEEPESPPEKKTSTSPPPEKSGDEGSEDEAPSGED,1,242,242,SRPVRNRKVVDYSQFQESDDADEDYGRDSGPPTKKIRSSPREAKNKRRSGKNSQEDSEDSEDKDVKTKKDDSHSAEDSEDEKEDHKNVRQQRQAASKAASKQREMLMEDVGSEEEQEGEDEAPFQEKDSGSDEDFLMEDDDDSDYGSSKKKNKKMVKKSKPERKEKKMPKPRLKATVTPSPVKGKGKVGRPTASKASKEKTPSPKEEDEEPESPPEKKTSTSPPPEKSGDEGSEDEAPSGED,27118.9806596899,27135.16738,PSI-MOD:17@118,RESID:51@0,,,1
14429,NUCKS_HUMAN,Q9H1E3,Nuclear ubiquitous casein and cyclin-dependent kinase substrate 1,Q9H1E3-1,1,MSRPVRNRKVVDYSQFQESDDADEDYGRDSGPPTKKIRSSPREAKNKRRSGKNSQEDSEDSEDKDVKTKKDDSHSAEDSEDEKEDHKNVRQQRQAASKAASKQREMLMEDVGSEEEQEEEDEAPFQEKDSGSDEDFLMEDDDDSDYGSSKKKNKKMVKKSKPERKEKKMPKPRLKATVTPSPVKGKGKVGRPTASKASKEKTPSPKEEDEEPESPPEKKTSTSPPPEKSGDEGSEDEAPSGED,1,242,242,SRPVRNRKVVDYSQFQESDDADEDYGRDSGPPTKKIRSSPREAKNKRRSGKNSQEDSEDSEDKDVKTKKDDSHSAEDSEDEKEDHKNVRQQRQAASKAASKQREMLMEDVGSEEEQEEEDEAPFQEKDSGSDEDFPMEDDDDSDYGSSKKKNKKMVKKSKPERKEKKMPKPRLKATVTPSPVKGKGKVGRPTASKASKEKTPSPKEEDEEPESPPEKKTSTSPPPEKSGDEGSEDEAPSGED,27654.7684756899,27671.06828,PSI-MOD:24@136,RESID:51@0|RESID:37@17|RESID:39@24|RESID:37@202|RESID:37@212|RESID:37@221|RESID:37@238,,,1
14435,NUCKS_HUMAN,Q9H1E3,Nuclear ubiquitous casein and cyclin-dependent kinase substrate 1,Q9H1E3-1,1,MSRPVRNRKVVDYSQFQESDDADEDYGRDSGPPTKKIRSSPREAKNKRRSGKNSQEDSEDSEDKDVKTKKDDSHSAEDSEDEKEDHKNVRQQRQAASKAASKQREMLMEDVGSEEEQEEEDEAPFQEKDSGSDEDFLMEDDDDSDYGSSKKKNKKMVKKSKPERKEKKMPKPRLKATVTPSPVKGKGKVGRPTASKASKEKTPSPKEEDEEPESPPEKKTSTSPPPEKSGDEGSEDEAPSGED,1,242,242,SRPVRNRKVVDYSQFQESDDADEDYGRDSGPPTKKIRSSPREAKNKRRSGKNSQEDSEDSEDKDVKTKKDDSHSAEDSEDEKEDHKNVRQQRQAASKAASKQREMLMEDVGSEEEQEEEDEAPFQEKDSGSDEDFPMEDDDDSDYGSSKKKNKKMVKKSKPERKEKKMPKPRLKATVTPSPVKGKGKVGRPTASKASKEKTPSPKEEDEEPESPPEKKTSTSPPPEKSGDEGSEDEAPSGED,27334.9031516899,27351.14828,PSI-MOD:24@136,RESID:51@0|RESID:39@24|RESID:37@238,,,1
14535,NUCKS_HUMAN,Q9H1E3,Nuclear ubiquitous casein and cyclin-dependent kinase substrate 1,Q9H1E3-1,1,MSRPVRNRKVVDYSQFQESDDADEDYGRDSGPPTKKIRSSPREAKNKRRSGKNSQEDSEDSEDKDVKTKKDDSHSAEDSEDEKEDHKNVRQQRQAASKAASKQREMLMEDVGSEEEQEEEDEAPFQEKDSGSDEDFLMEDDDDSDYGSSKKKNKKMVKKSKPERKEKKMPKPRLKATVTPSPVKGKGKVGRPTASKASKEKTPSPKEEDEEPESPPEKKTSTSPPPEKSGDEGSEDEAPSGED,1,242,242,SRPVRNRKVVDYSQFQESDDADEDYGRDSGPPTKKIRSSPREAKNKRRSGKNSQEDSEDSEDKDVKTKKDDSHSAEDSEDEKEDHKNVRQQRQAASKAASKQREMLMEDVGSEEEQEGEDEAPFQEKDSGSDEDFLMEDDDDSDYGSSKKKNKKMVKKSKPERKEKKMPKPRLKATVTPSPVKGKGKVGRPTASKASKEKTPSPKEEDEEPESPPEKKTSTSPPPEKSGDEGSEDEAPSGED,27198.9469906899,27215.14738,PSI-MOD:17@118,RESID:51@0|RESID:37@17,,,1