PFR,UniProt Id,Entry Accession,Entry Description,Isoform Accession,Isoform Description,Isoform Sequence,Start,End,Length,Proteoform Sequence,Monoisotopic Mass,Average Mass,Sequence Modifications,PTMs,N-Terminal,C-Terminal,Star
1819,TOM22_HUMAN,Q9NS69,Mitochondrial import receptor subunit TOM22 homolog,Q9NS69,,MAAAVAAAGAGEPQSPDELLPKGDAEKPEEELEEDDDEELDETLSERLWGLTEMFPERVRSAAGATFDLSLFVAQKMYRFSRAALWIGTTSFMILVLPVVFETEKLQMEQQQQLQQRQILLGPNTGLSGGMPGALPSLPGKI,1,141,141,AAAVAAAGAGEPQSPDELLPKGDAEKPEEELEEDDDEELDETLSERLWGLTEMFPERVRSAAGATFDLSLFVAQKMYRFSRAALWIGTTSFMILVLPVVFETEKLQMEQQQQLQQRQILLGPNTGLSGGMPGALPSLPGKI,15422.75439969,15432.46518,,RESID:41@0,,,1
2983,TOM22_HUMAN,Q9NS69,Mitochondrial import receptor subunit TOM22 homolog,Q9NS69,,MAAAVAAAGAGEPQSPDELLPKGDAEKPEEELEEDDDEELDETLSERLWGLTEMFPERVRSAAGATFDLSLFVAQKMYRFSRAALWIGTTSFMILVLPVVFETEKLQMEQQQQLQQRQILLGPNTGLSGGMPGALPSLPGKI,0,141,142,MAAAVAAAGAGEPQSPDELLPKGDAEKPEEELEEDDDEELDETLSERLWGLTEMFPERVRSAAGATFDLSLFVAQKMYRFSRAALWIGTTSFMILVLPVVFETEKLQMEQQQQLQQRQILLGPNTGLSGGMPGALPSLPGKI,15675.77178569,15685.67778,,RESID:49@0|RESID:41@1|RESID:38@42,,,1
3443,TOM22_HUMAN,Q9NS69,Mitochondrial import receptor subunit TOM22 homolog,Q9NS69,,MAAAVAAAGAGEPQSPDELLPKGDAEKPEEELEEDDDEELDETLSERLWGLTEMFPERVRSAAGATFDLSLFVAQKMYRFSRAALWIGTTSFMILVLPVVFETEKLQMEQQQQLQQRQILLGPNTGLSGGMPGALPSLPGKI,1,141,141,AAAVAAAGAGEPQSPDELLPKGDAEKPEEELEEDDDEELDETLSERLWGLTEMFPERVRSAAGATFDLSLFVAQKMYRFSRAALWIGTTSFMILVLPVVFETEKLQMEQQQQLQQRQILLGPNTGLSGGMPGALPSLPGKI,15460.71016569,15470.40518,,RESID:37@13,,,1
3444,TOM22_HUMAN,Q9NS69,Mitochondrial import receptor subunit TOM22 homolog,Q9NS69,,MAAAVAAAGAGEPQSPDELLPKGDAEKPEEELEEDDDEELDETLSERLWGLTEMFPERVRSAAGATFDLSLFVAQKMYRFSRAALWIGTTSFMILVLPVVFETEKLQMEQQQQLQQRQILLGPNTGLSGGMPGALPSLPGKI,1,141,141,AAAVAAAGAGEPQSPDELLPKGDAEKPEEELEEDDDEELDETLSERLWGLTEMFPERVRSAAGATFDLSLFVAQKMYRFSRAALWIGTTSFMILVLPVVFETEKLQMEQQQQLQQRQILLGPNTGLSGGMPGALPSLPGKI,15380.74383469,15390.42518,,,,,1
3626,TOM22_HUMAN,Q9NS69,Mitochondrial import receptor subunit TOM22 homolog,Q9NS69,,MAAAVAAAGAGEPQSPDELLPKGDAEKPEEELEEDDDEELDETLSERLWGLTEMFPERVRSAAGATFDLSLFVAQKMYRFSRAALWIGTTSFMILVLPVVFETEKLQMEQQQQLQQRQILLGPNTGLSGGMPGALPSLPGKI,1,141,141,AAAVAAAGAGEPQSPDELLPKGDAEKPEEELEEDDDEELDETLSERLWGLTEMFPERVRSAAGATFDLSLFVAQKMYRFSRAALWIGTTSFMILVLPVVFETEKLQMEQQQQLQQRQILLGPNTGLSGGMPGALPSLPGKI,15582.68706169,15592.42518,,RESID:41@0|RESID:37@13|RESID:38@41,,,1
6264,TOM22_HUMAN,Q9NS69,Mitochondrial import receptor subunit TOM22 homolog,Q9NS69,,MAAAVAAAGAGEPQSPDELLPKGDAEKPEEELEEDDDEELDETLSERLWGLTEMFPERVRSAAGATFDLSLFVAQKMYRFSRAALWIGTTSFMILVLPVVFETEKLQMEQQQQLQQRQILLGPNTGLSGGMPGALPSLPGKI,0,141,142,MAAAVAAAGAGEPQSPDELLPKGDAEKPEEELEEDDDEELDETLSERLWGLTEMFPERVRSAAGATFDLSLFVAQKMYRFSRAALWIGTTSFMILVLPVVFETEKLQMEQQQQLQQRQILLGPNTGLSGGMPGALPSLPGKI,15553.79488969,15563.65778,,RESID:49@0,,,1
8073,TOM22_HUMAN,Q9NS69,Mitochondrial import receptor subunit TOM22 homolog,Q9NS69,,MAAAVAAAGAGEPQSPDELLPKGDAEKPEEELEEDDDEELDETLSERLWGLTEMFPERVRSAAGATFDLSLFVAQKMYRFSRAALWIGTTSFMILVLPVVFETEKLQMEQQQQLQQRQILLGPNTGLSGGMPGALPSLPGKI,0,141,142,MAAAVAAAGAGEPQSPDELLPKGDAEKPEEELEEDDDEELDETLSERLWGLTEMFPERVRSAAGATFDLSLFVAQKMYRFSRAALWIGTTSFMILVLPVVFETEKLQMEQQQQLQQRQILLGPNTGLSGGMPGALPSLPGKI,15553.79488969,15563.65778,,RESID:41@1,,,1
12420,TOM22_HUMAN,Q9NS69,Mitochondrial import receptor subunit TOM22 homolog,Q9NS69,,MAAAVAAAGAGEPQSPDELLPKGDAEKPEEELEEDDDEELDETLSERLWGLTEMFPERVRSAAGATFDLSLFVAQKMYRFSRAALWIGTTSFMILVLPVVFETEKLQMEQQQQLQQRQILLGPNTGLSGGMPGALPSLPGKI,1,141,141,AAAVAAAGAGEPQSPDELLPKGDAEKPEEELEEDDDEELDETLSERLWGLTEMFPERVRSAAGATFDLSLFVAQKMYRFSRAALWIGTTSFMILVLPVVFETEKLQMEQQQQLQQRQILLGPNTGLSGGMPGALPSLPGKI,15502.72073069,15512.44518,,RESID:41@0|RESID:37@13,,,1
12427,TOM22_HUMAN,Q9NS69,Mitochondrial import receptor subunit TOM22 homolog,Q9NS69,,MAAAVAAAGAGEPQSPDELLPKGDAEKPEEELEEDDDEELDETLSERLWGLTEMFPERVRSAAGATFDLSLFVAQKMYRFSRAALWIGTTSFMILVLPVVFETEKLQMEQQQQLQQRQILLGPNTGLSGGMPGALPSLPGKI,1,141,141,AAAVAAAGAGEPQSPDELLPKGDAEKPEEELEEDDDEELDETLSERLWGLTEMFPERVRSAAGATFDLSLFVAQKMYRFSRAALWIGTTSFMILVLPVVFETEKLQMEQQQQLQQRQILLGPNTGLSGGMPGALPSLPGKI,15502.72073069,15512.44518,,RESID:41@0|RESID:38@41,,,1
13286,TOM22_HUMAN,Q9NS69,Mitochondrial import receptor subunit TOM22 homolog,Q9NS69,,MAAAVAAAGAGEPQSPDELLPKGDAEKPEEELEEDDDEELDETLSERLWGLTEMFPERVRSAAGATFDLSLFVAQKMYRFSRAALWIGTTSFMILVLPVVFETEKLQMEQQQQLQQRQILLGPNTGLSGGMPGALPSLPGKI,1,141,141,AAAVAAAGAGEPQSPDELLPKGDAEKPEEELEEDDDEELDETLSERLWGLTEMFPERVRSAAGATFDLSLFVAQKMYRFSRAALWIGTTSFMILVLPVVFETEKLQMEQQQQLQQRQILLGPNTGLSGGMPGALPSLPGKI,15460.71016569,15470.40518,,RESID:38@41,,,1
13945,TOM22_HUMAN,Q9NS69,Mitochondrial import receptor subunit TOM22 homolog,Q9NS69,,MAAAVAAAGAGEPQSPDELLPKGDAEKPEEELEEDDDEELDETLSERLWGLTEMFPERVRSAAGATFDLSLFVAQKMYRFSRAALWIGTTSFMILVLPVVFETEKLQMEQQQQLQQRQILLGPNTGLSGGMPGALPSLPGKI,0,141,142,MAAAVAAAGAGEPQSPDELLPKGDAEKPEEELEEDDDEELDETLSERLWGLTEMFPERVRSAAGATFDLSLFVAQKMYRFSRAALWIGTTSFMILVLPVVFETEKLQMEQQQQLQQRQILLGPNTGLSGGMPGALPSLPGKI,15591.75065569,15601.59778,,RESID:37@14,,,1
14215,TOM22_HUMAN,Q9NS69,Mitochondrial import receptor subunit TOM22 homolog,Q9NS69,,MAAAVAAAGAGEPQSPDELLPKGDAEKPEEELEEDDDEELDETLSERLWGLTEMFPERVRSAAGATFDLSLFVAQKMYRFSRAALWIGTTSFMILVLPVVFETEKLQMEQQQQLQQRQILLGPNTGLSGGMPGALPSLPGKI,0,141,142,MAAAVAAAGAGEPQSPDELLPKGDAEKPEEELEEDDDEELDETLSERLWGLTEMFPERVRSAAGATFDLSLFVAQKMYRFSRAALWIGTTSFMILVLPVVFETEKLQMEQQQQLQQRQILLGPNTGLSGGMPGALPSLPGKI,15511.78432469,15521.61778,,,,,1
15993,TOM22_HUMAN,Q9NS69,Mitochondrial import receptor subunit TOM22 homolog,Q9NS69,,MAAAVAAAGAGEPQSPDELLPKGDAEKPEEELEEDDDEELDETLSERLWGLTEMFPERVRSAAGATFDLSLFVAQKMYRFSRAALWIGTTSFMILVLPVVFETEKLQMEQQQQLQQRQILLGPNTGLSGGMPGALPSLPGKI,1,141,141,AAAVAAAGAGEPQSPDELLPKGDAEKPEEELEEDDDEELDETLSERLWGLTEMFPERVRSAAGATFDLSLFVAQKMYRFSRAALWIGTTSFMILVLPVVFETEKLQMEQQQQLQQRQILLGPNTGLSGGMPGALPSLPGKI,15422.7544,15432.46518,,,PSI-MOD:1458,,0
