PFR,UniProt Id,Entry Accession,Entry Description,Isoform Accession,Isoform Description,Isoform Sequence,Start,End,Length,Proteoform Sequence,Monoisotopic Mass,Average Mass,Sequence Modifications,PTMs,N-Terminal,C-Terminal,Star
1470,QCR9_HUMAN,Q9UDW1,Cytochrome b-c1 complex subunit 9,Q9UDW1-1,1,MAAATLTSKLYSLLFRRTSTFALTIIVGVMFFERAFDQGADAIYDHINEGKLWKHIKHKYENK,1,62,62,AAATLTSKLYSLLFRRTSTFALTIIVGVMFFERAFDQGADAIYDHINEGKLWKHIKHKYENK,7172.78537469,7177.29908,,,,,1
6767,QCR9_HUMAN,Q9UDW1,Cytochrome b-c1 complex subunit 9,Q9UDW1-1,1,MAAATLTSKLYSLLFRRTSTFALTIIVGVMFFERAFDQGADAIYDHINEGKLWKHIKHKYENK,0,62,63,MAAATLTSKLYSLLFRRTSTFALTIIVGVMFFERAFDQGADAIYDHINEGKLWKHIKHKYENK,7303.82586469,7308.49168,,,,,1
12375,QCR9_HUMAN,Q9UDW1,Cytochrome b-c1 complex subunit 9,Q9UDW1-1,1,MAAATLTSKLYSLLFRRTSTFALTIIVGVMFFERAFDQGADAIYDHINEGKLWKHIKHKYENK,1,62,62,AAATLTSKLYSLLFRRTSTFALTIIVGVMFFERAFDQGADAIYDHVNEGKLWKHIKHKYENK,7158.76972469,7163.27228,PSI-MOD:29@46,,,,1
12378,QCR9_HUMAN,Q9UDW1,Cytochrome b-c1 complex subunit 9,Q9UDW1-1,1,MAAATLTSKLYSLLFRRTSTFALTIIVGVMFFERAFDQGADAIYDHINEGKLWKHIKHKYENK,1,62,62,AAATLTSKLYSLLFRRTSTFALTIIVGVMFFERAFDQGADAIYDHINEGKLWKHIKHKYENK,7214.79593969,7219.33908,,RESID:41@0,,,1
12462,QCR9_HUMAN,Q9UDW1,Cytochrome b-c1 complex subunit 9,Q9UDW1-1,1,MAAATLTSKLYSLLFRRTSTFALTIIVGVMFFERAFDQGADAIYDHINEGKLWKHIKHKYENK,1,62,62,AAATLTSKLYSLLFRRTSTFALTIIVGVMFFERAFDQGADAIYDHVNEGKLWKHIKHKYENK,7200.78028969,7205.31228,PSI-MOD:29@46,RESID:41@0,,,1
13304,QCR9_HUMAN,Q9UDW1,Cytochrome b-c1 complex subunit 9,Q9UDW1-1,1,MAAATLTSKLYSLLFRRTSTFALTIIVGVMFFERAFDQGADAIYDHINEGKLWKHIKHKYENK,0,62,63,MAAATLTSKLYSLLFRRTSTFALTIIVGVMFFERAFDQGADAIYDHVNEGKLWKHIKHKYENK,7289.81021469,7294.46488,PSI-MOD:29@46,,,,1
14683,QCR9_HUMAN,Q9UDW1,Cytochrome b-c1 complex subunit 9,Q9UDW1-1,1,MAAATLTSKLYSLLFRRTSTFALTIIVGVMFFERAFDQGADAIYDHINEGKLWKHIKHKYENK,0,62,63,MAAATLTSKLYSLLFRRTSTFALTIIVGVMFFERAFDQGADAIYDHINEGKLWKHIKHKYENK,7345.83642969,7350.53168,,RESID:49@0,,,1
16498,QCR9_HUMAN,Q9UDW1,Cytochrome b-c1 complex subunit 9,Q9UDW1-1,1,MAAATLTSKLYSLLFRRTSTFALTIIVGVMFFERAFDQGADAIYDHINEGKLWKHIKHKYENK,26,62,37,VGVMFFERAFDQGADAIYDHINEGKLWKHIKHKYENK,4433.216695,4436.02968,,,,,0
17644,QCR9_HUMAN,Q9UDW1,Cytochrome b-c1 complex subunit 9,Q9UDW1-1,1,MAAATLTSKLYSLLFRRTSTFALTIIVGVMFFERAFDQGADAIYDHINEGKLWKHIKHKYENK,1,62,62,AAATLTSKLYSLLFRRTSTFALTIIVGVMFFERAFDQGADAIYDHINEGKLWKHIKHKYENK,7214.79594,7219.33908,,,PSI-MOD:1458,,0
17751,QCR9_HUMAN,Q9UDW1,Cytochrome b-c1 complex subunit 9,Q9UDW1-1,1,MAAATLTSKLYSLLFRRTSTFALTIIVGVMFFERAFDQGADAIYDHINEGKLWKHIKHKYENK,2,62,61,AATLTSKLYSLLFRRTSTFALTIIVGVMFFERAFDQGADAIYDHINEGKLWKHIKHKYENK,7101.748265,7106.22028,,,,,0
17982,QCR9_HUMAN,Q9UDW1,Cytochrome b-c1 complex subunit 9,Q9UDW1-1,1,MAAATLTSKLYSLLFRRTSTFALTIIVGVMFFERAFDQGADAIYDHINEGKLWKHIKHKYENK,30,62,33,FFERAFDQGADAIYDHINEGKLWKHIKHKYENK,4047.017925,4049.51998,,,,,0
18270,QCR9_HUMAN,Q9UDW1,Cytochrome b-c1 complex subunit 9,Q9UDW1-1,1,MAAATLTSKLYSLLFRRTSTFALTIIVGVMFFERAFDQGADAIYDHINEGKLWKHIKHKYENK,29,62,34,MFFERAFDQGADAIYDHINEGKLWKHIKHKYENK,4178.058415,4180.71258,,,,,0
18302,QCR9_HUMAN,Q9UDW1,Cytochrome b-c1 complex subunit 9,Q9UDW1-1,1,MAAATLTSKLYSLLFRRTSTFALTIIVGVMFFERAFDQGADAIYDHINEGKLWKHIKHKYENK,27,62,36,GVMFFERAFDQGADAIYDHINEGKLWKHIKHKYENK,4334.148285,4336.89708,,,,,0
