PFR,UniProt Id,Entry Accession,Entry Description,Isoform Accession,Isoform Description,Isoform Sequence,Start,End,Length,Proteoform Sequence,Monoisotopic Mass,Average Mass,Sequence Modifications,PTMs,N-Terminal,C-Terminal,Star
2107,SSRG_HUMAN,Q9UNL2,Translocon-associated protein subunit gamma,Q9UNL2-1,1,MAPKGSSKQQSEEDLLLQDFSRNLSAKSSALFFGNAFIVSAIPIWLYWRIWHMDLIQSAVLYSVMTLVSTYLVAFAYKNVKFVLKHKVAQKREDAVSKEVTRKLSEADNRKMSRKEKDERILWKKNEVADYEATTFSIFYNNTLFLVVVIVASFFILKNFNPTVNYILSISASSGLIALLSTGSK,1,184,184,APKGSSKQQSEEDLLLQDFSRNLSAKSSALFFGNAFIVSAIPIWLYWRIWHMDLIQSAVLYSVMTLVSTYLVAFAYKNVKFVLKHKVAQKREDAVSKEVTRKLSEADNRKMSRKEKDERILWKKNEVADYEATTFSIFYNNTLFLVVVIVASFFILKNFNPTVNYILSISASSGLIALLSTGSK,20978.16652969,20991.34478,,RESID:41@0,,,1
2923,SSRG_HUMAN,Q9UNL2,Translocon-associated protein subunit gamma,Q9UNL2-1,1,MAPKGSSKQQSEEDLLLQDFSRNLSAKSSALFFGNAFIVSAIPIWLYWRIWHMDLIQSAVLYSVMTLVSTYLVAFAYKNVKFVLKHKVAQKREDAVSKEVTRKLSEADNRKMSRKEKDERILWKKNEVADYEATTFSIFYNNTLFLVVVIVASFFILKNFNPTVNYILSISASSGLIALLSTGSK,1,184,184,APKGSSKQQSEEDLLLQDFSRNLSAKSSALFFGNAFIVSAIPIWLYWRIWHMDLIQSAVLYSVMTLVSTYLVAFAYKNVKFVLKHKVAQKREDAVSKEVTRKLSEADNRKMSRKEKDERILWKKNEVADYEATTFSIFYNNTLFLVVVIVASFFILKNFNPTVNYILSISASSGLIALLSTGSK,20936.15596469,20949.30478,,,,,1
3095,SSRG_HUMAN,Q9UNL2,Translocon-associated protein subunit gamma,Q9UNL2-1,1,MAPKGSSKQQSEEDLLLQDFSRNLSAKSSALFFGNAFIVSAIPIWLYWRIWHMDLIQSAVLYSVMTLVSTYLVAFAYKNVKFVLKHKVAQKREDAVSKEVTRKLSEADNRKMSRKEKDERILWKKNEVADYEATTFSIFYNNTLFLVVVIVASFFILKNFNPTVNYILSISASSGLIALLSTGSK,0,184,185,MAPKGSSKQQSEEDLLLQDFSRNLSAKSSALFFGNAFIVSAIPIWLYWRIWHMDLIQSAVLYSVMTLVSTYLVAFAYKNVKFVLKHKVAQKREDAVSKEVTRKLSEADNRKMSRKEKDERILWKKNEVADYEATTFSIFYNNTLFLVVVIVASFFILKNFNPTVNYILSISASSGLIALLSTGSK,21067.19645469,21080.49738,,,,,1
4439,SSRG_HUMAN,Q9UNL2,Translocon-associated protein subunit gamma,Q9UNL2-1,1,MAPKGSSKQQSEEDLLLQDFSRNLSAKSSALFFGNAFIVSAIPIWLYWRIWHMDLIQSAVLYSVMTLVSTYLVAFAYKNVKFVLKHKVAQKREDAVSKEVTRKLSEADNRKMSRKEKDERILWKKNEVADYEATTFSIFYNNTLFLVVVIVASFFILKNFNPTVNYILSISASSGLIALLSTGSK,0,184,185,MAPKGSSKQQSEEDLLLQDFSRNLSAKSSALFFGNAFIVSAIPIWLYWRIWHMDLIQSAVLYSVMTLVSTYLVAFAYKNVKFVLKHKVAQKREDAVSKEVTRKLSEADNRKMSRKEKDERILWKKNEVADYEATTFSIFYNNTLFLVVVIVASFFILKNFNPTVNYILSISASSGLIALLSTGSK,21109.20701969,21122.53738,,RESID:49@0,,,1
14523,SSRG_HUMAN,Q9UNL2,Translocon-associated protein subunit gamma,Q9UNL2-1,1,MAPKGSSKQQSEEDLLLQDFSRNLSAKSSALFFGNAFIVSAIPIWLYWRIWHMDLIQSAVLYSVMTLVSTYLVAFAYKNVKFVLKHKVAQKREDAVSKEVTRKLSEADNRKMSRKEKDERILWKKNEVADYEATTFSIFYNNTLFLVVVIVASFFILKNFNPTVNYILSISASSGLIALLSTGSK,1,184,184,APKGSSKQQSEEDLLLQDFSRNLSAKSSALFFGNAFIVSAIPIWLYWRIWHMDLIQSAVLYSVMTLVSTYLVAFAYKNVKFVLKHKVAQKREDAVSKEVTRKLSEADNRKMSRKEKDERILWKKNEVADYEATTFSIFYNNTLFLVVVIVASFFILKNFNPTVNYILSISASSGLIALLSTGSK,21016.12229569,21029.28478,,RESID:37@103,,,1
14799,SSRG_HUMAN,Q9UNL2,Translocon-associated protein subunit gamma,Q9UNL2-1,1,MAPKGSSKQQSEEDLLLQDFSRNLSAKSSALFFGNAFIVSAIPIWLYWRIWHMDLIQSAVLYSVMTLVSTYLVAFAYKNVKFVLKHKVAQKREDAVSKEVTRKLSEADNRKMSRKEKDERILWKKNEVADYEATTFSIFYNNTLFLVVVIVASFFILKNFNPTVNYILSISASSGLIALLSTGSK,0,184,185,MAPKGSSKQQSEEDLLLQDFSRNLSAKSSALFFGNAFIVSAIPIWLYWRIWHMDLIQSAVLYSVMTLVSTYLVAFAYKNVKFVLKHKVAQKREDAVSKEVTRKLSEADNRKMSRKEKDERILWKKNEVADYEATTFSIFYNNTLFLVVVIVASFFILKNFNPTVNYILSISASSGLIALLSTGSK,21269.13968169,21282.49738,,RESID:49@0|RESID:37@10|RESID:37@104,,,1
19447,SSRG_HUMAN,Q9UNL2,Translocon-associated protein subunit gamma,Q9UNL2,,MAPKGSSKQQSEEDLLLQDFSRNLSAKSSALFFGNAFIVSAIPIWLYWRIWHMDLIQSAVLYSVMTLVSTYLVAFAYKNVKFVLKHKVAQKREDAVSKEVTRKLSEADNRKMSRKEKDERILWKKNEVADYEATTFSIFYNNTLFLVVVIVASFFILKNFNPTVNYILSISASSGLIALLSTGSK,1,184,184,APKGSSKQQSEEDLLLQDFSRNLSAKSSALFFGNAFIVSAIPIWLYWRIWHMDLIQSAVLYSVMTLVSTYLVAFAYKNVKFVLKHKVAQKREDAVSKEVTRKLSEADNRKMSRKEKDERILWKKNEVADYEATTFSIFYNNTLFLVVVIVASFFILKNFNPTVNYILSISASSGLIALLSTGSK,20936.15596469,20949.30478,,,,,0
19966,SSRG_HUMAN,Q9UNL2,Translocon-associated protein subunit gamma,Q9UNL2,,MAPKGSSKQQSEEDLLLQDFSRNLSAKSSALFFGNAFIVSAIPIWLYWRIWHMDLIQSAVLYSVMTLVSTYLVAFAYKNVKFVLKHKVAQKREDAVSKEVTRKLSEADNRKMSRKEKDERILWKKNEVADYEATTFSIFYNNTLFLVVVIVASFFILKNFNPTVNYILSISASSGLIALLSTGSK,3,184,182,KGSSKQQSEEDLLLQDFSRNLSAKSSALFFGNAFIVSAIPIWLYWRIWHMDLIQSAVLYSVMTLVSTYLVAFAYKNVKFVLKHKVAQKREDAVSKEVTRKLSEADNRKMSRKEKDERILWKKNEVADYEATTFSIFYNNTLFLVVVIVASFFILKNFNPTVNYILSISASSGLIALLSTGSK,20768.06609,20781.10928,,,,,0
